{"text_format":"1","workbook":"xlsx","n_sheets":2,"sheets":["Hoja1","FORMATO RT-PLT-01.1 "],"not_rendered":{"charts":0,"images":1,"macros":1,"external_links":0,"defined_names":0,"comments":0,"pivot_tables":0},"unopened":[],"bounds":{"document_bytes":16777216,"sheet_cells":100000,"rows_first":2000,"rows_last":500,"rows_between":2000,"halvings":0,"cell_chars":16384,"cell_head_chars":4096},"cells_cut":0,"cells_raw":0,"read":"whole","date_system":"1900"}

{"sheet":"Hoja1","index":0,"n_rows":13,"n_cols":6,"rows_kept":13,"cut":false,"hidden":true,"merged":[[0,1,0,5]]}
[null,"No modificar estas Tablas"]
[null,"Segmento:",null,"Plan",null,"Plan"]
[null,"Escoja Segmento",null,"Escoja un Plan",null,"Escoja un Plan"]
[null,"Prepago",null,{"$f":"IF(#REF!=3,D11,IF(#REF!=4,F11,\"---\"))","v":{"$error":"#REF!"}},null,{"$f":"IF('FORMATO RT-PLT-01.1 '!$E$9=3,Hoja1!D11,\"---\")","v":"---"}]
[null,"Pospago",null,{"$f":"IF(#REF!=3,D12,IF(#REF!=4,F12,\"---\"))","v":{"$error":"#REF!"}},null,{"$f":"IF('FORMATO RT-PLT-01.1 '!$E$9=3,Hoja1!D12,\"---\")","v":"---"}]
[null,"Ambos (Prep & Posp)",null,{"$f":"IF(#REF!=3,D13,IF(#REF!=4,F13,\"---\"))","v":{"$error":"#REF!"}},null,{"$f":"IF('FORMATO RT-PLT-01.1 '!$E$9=3,Hoja1!D13,\"---\")","v":"---"}]
[]
[]
[null,null,null,"Plan",null,"Plan 2"]
[null,null,null,"Escoja un Plan",null,"Escoja un Plan"]
[null,null,null,"Abierto",null,"Prep. y Posp. Abierto"]
[null,null,null,"Controlado",null,"Prep. y Posp. Controlado"]
[null,null,null,"Abierto y/o controlado",null,"Prep. Y Posp. (Todos)"]

{"sheet":"FORMATO RT-PLT-01.1 ","index":1,"n_rows":58,"n_cols":8,"rows_kept":58,"cut":false,"hidden":false,"merged":[[13,13,13,22],[15,13,15,22],[13,3,13,4],[23,3,23,6],[24,3,24,4],[28,2,29,2],[28,4,29,4],[28,5,29,5],[28,6,29,6],[28,3,29,3],[1,2,1,7],[2,2,2,7],[17,5,17,6],[3,3,3,5],[4,3,4,4],[6,3,6,5],[7,3,7,4],[11,3,11,4],[55,3,55,7],[5,3,5,5],[18,5,18,7],[19,5,19,7],[20,5,20,7],[21,5,21,7],[11,5,11,6],[13,5,13,6],[15,3,15,5],[16,3,16,4],[54,4,54,6],[53,3,53,7],[51,3,51,7],[28,7,29,7],[26,3,26,7]]}
[]
[null,null,"FORMATO RT-PLT-01.1  "]
[null,null,"Registro de Tarifas de Larga Distancia Internacional"]
[null,null,"Número de Oficio"]
[null,null,"Fecha de Oficio:",null,null,"1900-01-01"]
[null,null,"Nombre del Prestador:"]
[null,null,"Nombre del Plan Tarifario:"]
[null,null,"Fecha de notificación del Plan Tarifario:"]
[null,null,"Segmento:",null,1,"Segmento:",{"$f":"INDEX(Hoja1!B3:B5,$E$9,1)","v":"Escoja Segmento"}]
[null,null,null,3,null,"Plan:",{"$f":"IF(G9=\"Pospago\",INDEX(Hoja1!F3:F6,'FORMATO RT-PLT-01.1 '!$D$10,1),\"---\")","v":"---"}]
[null,null,"Plan:"]
[null,null,"Si es modificado señalar: ","Nombre original del Plan:"]
[null,null,"Tarifa:"]
[null,null,"Si es modificado señalar: ","Nombre original de la Tarifa:"]
[]
[null,null,"Número Oficio de notificación inicial/anterior:"]
[null,null,"Fecha de notificación inicial/anterior:"]
[]
[null,null,"Servicios incluidos en el Plan/Tarifa:",null,"Detalle:"]
[null,null,null,null,"Detalle:"]
[null,null,null,null,"Detalle:"]
[null,null,null,null,"Detalle:"]
[]
[null,null,"Costo de activación (donde aplique)"]
[null,null,"Fecha de entrada en vigencia del Plan/Tarifa:"]
[]
[null,null,"Condiciones generales del Plan/Tarifa:"]
[]
[null,null,"Descripción del Plan/Tarifa \n(Servicios que incluye, etc.)","Código de Identificación del Plan/Tarifa *","Destino","Tarifa por Minuto LDI\n(US$ por min.)","Tarifa por SMS LDI\n(US$ por SMS)","Tarifa por MMS LDI\n(US$ por MMS)"]
[]
[]
[]
[]
[]
[]
[]
[]
[]
[]
[]
[]
[]
[]
[]
[]
[]
[]
[]
[]
[]
[null,null,null,null,9.9999999999999998E-13]
[null,null,"Tarifas incluyen impuestos aplicables de Ley:"]
[]
[null,null,"Restricciones aplicables al Plan/Tarifa:"]
[]
[null,null,"Otras Observaciones:"]
[]
[null,null,"* Código que es usado en las plataformas de tasación y facturación de las operadoras del SMA."]