{"text_format":"1","workbook":"xlsx","n_sheets":2,"sheets":["Hoja1","FORMATO RT-PLT-01"],"not_rendered":{"charts":0,"images":1,"macros":1,"external_links":0,"defined_names":0,"comments":0,"pivot_tables":0},"unopened":[],"bounds":{"document_bytes":16777216,"sheet_cells":100000,"rows_first":2000,"rows_last":500,"rows_between":2000,"halvings":0,"cell_chars":16384,"cell_head_chars":4096},"cells_cut":0,"cells_raw":0,"read":"whole","date_system":"1900"}

{"sheet":"Hoja1","index":0,"n_rows":13,"n_cols":6,"rows_kept":13,"cut":false,"hidden":true,"merged":[[0,1,0,5]]}
[null,"No modificar estas Tablas"]
[null,"Segmento:",null,"Plan",null,"Plan"]
[null,"Escoja Segmento",null,"Escoja un Plan",null,"Escoja un Plan"]
[null,"Prepago",null,{"$f":"IF(#REF!=3,D11,IF(#REF!=4,F11,\"---\"))","v":{"$error":"#REF!"}},null,{"$f":"IF('FORMATO RT-PLT-01'!$F$9=3,Hoja1!D11,\"---\")","v":"---"}]
[null,"Pospago",null,{"$f":"IF(#REF!=3,D12,IF(#REF!=4,F12,\"---\"))","v":{"$error":"#REF!"}},null,{"$f":"IF('FORMATO RT-PLT-01'!$F$9=3,Hoja1!D12,\"---\")","v":"---"}]
[null,"Ambos (Prep & Posp)",null,{"$f":"IF(#REF!=3,D13,IF(#REF!=4,F13,\"---\"))","v":{"$error":"#REF!"}},null,{"$f":"IF('FORMATO RT-PLT-01'!$F$9=3,Hoja1!D13,\"---\")","v":"---"}]
[]
[]
[null,null,null,"Plan",null,"Plan 2"]
[null,null,null,"Escoja un Plan",null,"Escoja un Plan"]
[null,null,null,"Abierto",null,"Prep. y Posp. Abierto"]
[null,null,null,"Controlado",null,"Prep. y Posp. Controlado"]
[null,null,null,"Abierto y/o controlado",null,"Prep. Y Posp. (Todos)"]

{"sheet":"FORMATO RT-PLT-01","index":1,"n_rows":55,"n_cols":37,"rows_kept":55,"cut":false,"hidden":false,"merged":[[30,23,31,23],[30,25,31,25],[1,1,1,36],[48,2,48,3],[30,36,31,36],[25,4,25,5],[27,4,27,36],[35,2,35,3],[36,2,36,3],[16,4,16,7],[23,6,23,11],[24,6,24,11],[30,11,31,11],[30,12,31,12],[22,6,22,11],[54,2,54,14],[30,33,31,33],[30,34,31,34],[30,35,31,35],[30,27,31,27],[30,28,31,28],[30,29,31,29],[30,30,31,30],[30,31,31,31],[30,26,31,26],[53,2,53,3],[44,2,44,3],[45,2,45,3],[46,2,46,3],[48,4,48,7],[30,22,31,22],[49,4,49,7],[51,2,51,3],[41,2,41,3],[42,2,42,3],[43,2,43,3],[51,4,51,36],[49,2,49,3],[53,4,53,36],[30,32,31,32],[29,34,29,36],[25,2,25,3],[27,2,27,3],[39,2,39,3],[40,2,40,3],[30,19,31,19],[30,20,31,20],[30,21,31,21],[37,2,37,3],[38,2,38,3],[29,2,31,3],[32,2,32,3],[33,2,33,3],[34,2,34,3],[29,30,29,33],[29,19,29,29],[30,13,30,14],[30,10,31,10],[29,4,31,4],[29,5,31,5],[30,6,31,6],[29,6,29,18],[30,7,31,7],[30,8,31,8],[30,9,31,9],[30,15,31,15],[30,16,31,16],[30,17,31,17],[30,18,31,18],[30,24,31,24],[12,5,12,8],[21,6,21,11],[3,4,3,7],[6,4,6,7],[11,4,11,5],[13,4,13,5],[11,6,11,8],[13,6,13,8],[13,11,13,17],[15,11,15,17],[18,11,18,17],[15,4,15,5],[15,6,15,8],[18,5,18,8],[19,6,19,11],[20,6,20,11]]}
[]
[null,"FORMATO RT-PLT-01: PLANES MÓVILES"]
[]
[null,null,"Número de Oficio"]
[null,null,"Fecha de Oficio:",null,null,"1900-01-01"]
[null,null,"Nombre del Prestador:"]
[null,null,"Nombre del Plan Tarifario:"]
[null,null,"Fecha de notificación del Plan Tarifario:"]
[null,null,null,"Segmento:",null,1,"Segmento:",{"$f":"INDEX(Hoja1!B3:B5,$F$9,1)","v":"Escoja Segmento"}]
[null,null,null,null,null,3,"Plan:",{"$f":"IF(H9=\"Pospago\",INDEX(Hoja1!F3:F6,'FORMATO RT-PLT-01'!$F$10,1),\"---\")","v":"---"}]
[null,null,"Plan: "]
[null,null,"Si es modificado señalar: ",null,"Nombre original del Plan:"]
[null,null,"Tarifa: "]
[null,null,"Si es modificado señalar: ",null,"Nombre original de la Tarifa:"]
[null,null,"Paquete: "]
[null,null,"Si es modificado señalar: ",null,"Nombre original del Paquete:"]
[null,null,"Número Oficio de notificación inicial/anterior:"]
[null,null,"Fecha de notificación inicial/anterior:"]
[]
[null,null,"Servicios incluidos en el Plan:"]
[]
[]
[]
[]
[]
[null,null,"Fecha de entrada en vigencia del Plan,Tarifa o Paquete:"]
[]
[null,null,"Condiciones generales del Plan,Tarifa o Paquete:"]
[]
[null,null,"Descripción del Plan/Tarifa o Paquete\n(Servicios que incluye, etc.)",null,"Código de Identificación del Plan/Tarifa *","Tarifa Mensual Total del Plan\n(US$)*","VOZ",null,null,null,null,null,null,null,null,null,null,null,null,"SMS",null,null,null,null,null,null,null,null,null,null,"DATOS",null,null,null,"Otros servicios adicionales"]
[null,null,null,null,null,null,"Tarifa Mensual Básica Voz\n(US$)","Tarifa por minuto\nIN-POOL\n(US$ por min.)","Minutos IN-POOL incluidos\n(min.)","Minutos gratis a cualquier operadora\n(min.)","Minutos On Net incluidos \n(min.)","Tarifa por minuto on net móvil  dentro del Plan\n(US$ por min.)","Tarifa por minuto on net móvil adicional al Plan\n(US$ por min.)","Minutos Off Net incluidos \n(min.)",null,"Tarifa por minuto off net móvil dentro del Plan\n(US$ por min.)","Tarifa por minuto off net fijo dentro del Plan\n(US$ por min.)","Tarifa por minuto off net móvil adicional al Plan\n(US$ por min.)","Tarifa por minuto off net fijo adicional al Plan\n(US$ por min.)","Tarifa Mensual Básica  SMS\n(US$)","Tarifa por SMS\nIN-POOL\n(US$ por SMS)","SMS\nIN-POOL incluidos\n(#SMS)","Mensajes on net Incluidos\n(# SMS)","Tarifa por SMS on net dentro del Plan\n(US$ por SMS)","Tarifa por SMS on net adicional al Plan\n(US$ por SMS)","Mensajes off net Incluidos\n(# SMS)","Mensajes a cualquier operadora\n(# SMS)","Mensajes gratis a cualquier operadora\n(# SMS)","Tarifa por SMS off net dentro del Plan\n(US$ por SMS)","Tarifa por SMS off net adicional al Plan\n(US$ por SMS)","Tarifa Mensual Básica de Datos\n(US$)","MB Incluidos en el Plan\n(MB)","Tarifa por MB dentro del Plan\n(US$ por MB)","Tarifa por MB adicional al Plan\n(US$ por MB)","Detalle","Unidad de medida","Tarifa US$"]
[null,null,null,null,null,null,null,null,null,null,null,null,null,"Móvil","Fijo"]
[]
[]
[]
[]
[]
[]
[]
[]
[]
[]
[]
[]
[]
[]
[]
[]
[null,null,"Destinos que  incluyen cargos de Interconexión:"]
[null,null,"Tarifas incluyen impuestos aplicables de Ley:"]
[]
[null,null,"Restricciones aplicables al  Plan,Tarifa o Paquete:"]
[]
[null,null,"Otras Observaciones:"]
[null,null,"* Código que es usado en las plataformas de tasación y facturación de las operadoras del SMA.\n* Tarifa Mensual Total del Plan (US$) = Tarifa Mensual Básica Voz (US$) + Tarifa Mensual Básica  SMS (US$) + Tarifa Mensual Básica de Datos (US$)\n"]