{"text_format":"1","workbook":"xlsx","n_sheets":2,"sheets":["Hoja1","FORMATO-RT-PLT-02"],"not_rendered":{"charts":0,"images":1,"macros":1,"external_links":0,"defined_names":1,"comments":0,"pivot_tables":0},"unopened":[],"bounds":{"document_bytes":16777216,"sheet_cells":100000,"rows_first":2000,"rows_last":500,"rows_between":2000,"halvings":0,"cell_chars":16384,"cell_head_chars":4096},"cells_cut":0,"cells_raw":0,"read":"whole","date_system":"1900"}

{"sheet":"Hoja1","index":0,"n_rows":13,"n_cols":6,"rows_kept":13,"cut":false,"hidden":true,"merged":[[0,1,0,5]]}
[null,"No modificar estas Tablas"]
[null,"Segmento:",null,"Plan",null,"Plan"]
[null,"Escoja Segmento",null,"Escoja un Plan",null,"Escoja un Plan"]
[null,"Prepago",null,{"$f":"IF(#REF!=3,D11,IF(#REF!=4,F11,\"---\"))","v":{"$error":"#REF!"}},null,{"$f":"IF('FORMATO-RT-PLT-02'!$F$9=3,Hoja1!D11,\"---\")","v":"---"}]
[null,"Pospago",null,{"$f":"IF(#REF!=3,D12,IF(#REF!=4,F12,\"---\"))","v":{"$error":"#REF!"}},null,{"$f":"IF('FORMATO-RT-PLT-02'!$F$9=3,Hoja1!D12,\"---\")","v":"---"}]
[null,"Ambos (Prep & Posp)",null,{"$f":"IF(#REF!=3,D13,IF(#REF!=4,F13,\"---\"))","v":{"$error":"#REF!"}},null,{"$f":"IF('FORMATO-RT-PLT-02'!$F$9=3,Hoja1!D13,\"---\")","v":"---"}]
[]
[]
[null,null,null,"Plan",null,"Plan 2"]
[null,null,null,"Escoja un Plan",null,"Escoja un Plan"]
[null,null,null,"Abierto",null,"Prep. y Posp. Abierto"]
[null,null,null,"Controlado",null,"Prep. y Posp. Controlado"]
[null,null,null,"Abierto y/o controlado",null,"Prep. Y Posp. (Todos)"]

{"sheet":"FORMATO-RT-PLT-02","index":1,"n_rows":59,"n_cols":35,"rows_kept":59,"cut":false,"hidden":false,"merged":[[14,4,14,6],[15,4,15,5],[30,5,30,20],[16,5,16,7],[34,21,35,21],[59,5,59,13],[56,4,56,20],[33,4,35,4],[31,4,31,34],[55,4,55,34],[57,4,57,34],[34,22,35,22],[33,32,34,34],[34,23,34,24],[34,17,34,19],[34,25,34,27],[33,28,33,31],[34,28,35,28],[34,29,35,29],[34,30,35,30],[34,31,35,31],[34,20,35,20],[12,14,12,20],[31,2,31,3],[33,5,35,5],[33,6,33,19],[33,20,33,27],[34,11,34,12],[34,13,34,14],[34,6,35,6],[34,7,35,7],[34,8,35,8],[34,9,34,10],[29,4,29,6],[34,15,34,16],[13,14,13,20],[14,14,14,20],[16,14,16,20],[1,1,1,34],[37,2,37,3],[38,2,38,3],[39,2,39,3],[40,2,40,3],[33,2,35,3],[36,2,36,3],[3,4,3,6],[4,4,4,5],[5,4,5,6],[6,4,6,6],[7,4,7,5],[11,6,11,8],[13,6,13,8],[11,4,11,5],[13,4,13,5],[50,2,50,3],[46,2,46,3],[47,2,47,3],[48,2,48,3],[49,2,49,3],[41,2,41,3],[42,2,42,3],[43,2,43,3],[44,2,44,3],[45,2,45,3],[55,2,55,3],[52,4,52,7],[53,4,53,7],[57,2,57,3],[58,2,58,6],[52,2,52,3],[53,2,53,3]]}
[]
[null,"FORMATO RT-PLT-02: PLANES DE TELEFONÍA FIJA"]
[]
[null,null,"Número de Oficio"]
[null,null,"Fecha de Oficio:"]
[null,null,"Nombre del Prestador:"]
[null,null,"Nombre del Plan Tarifario:"]
[null,null,"Fecha de notificación del Plan Tarifario:"]
[null,null,null,"Segmento:",null,1,"Segmento:",{"$f":"INDEX(Hoja1!B3:B5,$F$9,1)","v":"Escoja Segmento"}]
[null,null,null,null,null,3,"Plan:",{"$f":"IF(H9=\"Pospago\",INDEX(Hoja1!F3:F6,'FORMATO-RT-PLT-02'!$F$10,1),\"---\")","v":"---"}]
[null,null,"Plan :"]
[null,null,"Si es modificado señalar: ",null,"Nombre original del Plan:"]
[null,null,"Tarifa:  "]
[null,null,"Si es modificado señalar: ",null,"       Nombre original de la Tarifa:"]
[null,null,"Número Oficio de notificación inicial/anterior:"]
[null,null,"Fecha de notificación inicial/anterior:"]
[]
[null,null,"Servicios incluidos en el Plan/Tarifa:"]
[]
[]
[]
[]
[]
[]
[]
[]
[]
[]
[]
[null,null,"Fecha de entrada en vigencia del Plan/Tarifa:"]
[]
[null,null,"Condiciones generales del Plan/Tarifa:"]
[]
[null,null,"Descripción del Plan/Tarifa\n(Servicios que incluye, etc.)",null,"Código de Identificación del Plan/Tarifa *","Tarifa Mensual Total del Plan \n(US$)","TelefonÍa Fija",null,null,null,null,null,null,null,null,null,null,null,null,null,"Terminales de Uso Público",null,null,null,null,null,null,null,"DATOS",null,null,null,"Otros servicios adicionales"]
[null,null,null,null,null,null,"Tarifa Mensual Básica \n(US$)","Minutos incluidos ON NET \n(min.)","Minutos incluidos OFF NET \n(min.)","Tarifa por minuto de llamada Local\n(US$ por min.)",null,"Tarifa por minuto de llamada Nacional\n(US$ por min.)",null,"Tarifa por minuto de llamada Regional\n(US$ por min.)",null,"Tarifa por minuto de llamada LDI",null,"Tarifa por minuto de llamada a Móviles (US$ por min.)",null,null,"Tarifa por minuto de llamada Local\n(US$ por min.)","Tarifa por minuto de llamada Nacional\n(US$ por min.)","Tarifa por minuto de llamada Regional\n(US$ por min.)","Tarifa por minuto de llamada LDI",null,"Tarifa por minuto de llamada a Móviles (US$ por min.)",null,null,"Tarifa Mensual Básica \n(US$)","Kbps Incluidos en el Plan\n(Kbps)","Tarifa por Kbps dentro del Plan\n(US$ por Kbps)","Tarifa por Kbps adicional al Plan\n(US$ por Kbps)"]
[null,null,null,null,null,null,null,null,null,"ON-NET","OFF-NET","ON-NET","OFF-NET","ON-NET","OFF-NET","Destino","US$ por min.","CONECEL S.A.","OTECEL S.A.","CNT EP.",null,null,null,"Destino","US$ por min.","CONECEL S.A.","OTECEL S.A.","CNT EP.",null,null,null,null,"Detalle","Unidad de medida","Tarifa US$"]
[]
[]
[]
[]
[]
[]
[]
[]
[]
[]
[]
[]
[]
[]
[]
[]
[null,null,"Destinos que  incluyen cargos de Interconexión:"]
[null,null,"Tarifas incluyen impuestos aplicables de Ley:"]
[]
[null,null,"Restricciones aplicables al Plan/Tarifa:"]
[]
[null,null,"Otras Observaciones:"]
[null,null,"* Código que es usado en las plataformas de tasación y facturación de las operadoras."]