{"text_format":"1","workbook":"xlsx","n_sheets":2,"sheets":["Hoja1","FORMATO RT-PR-01"],"not_rendered":{"charts":0,"images":1,"macros":1,"external_links":0,"defined_names":0,"comments":0,"pivot_tables":0},"unopened":[],"bounds":{"document_bytes":16777216,"sheet_cells":100000,"rows_first":2000,"rows_last":500,"rows_between":2000,"halvings":0,"cell_chars":16384,"cell_head_chars":4096},"cells_cut":0,"cells_raw":0,"read":"whole","date_system":"1900"}

{"sheet":"Hoja1","index":0,"n_rows":13,"n_cols":6,"rows_kept":13,"cut":false,"hidden":true,"merged":[[0,1,0,5]]}
[null,"No modificar estas Tablas"]
[null,"Segmento:",null,"Plan",null,"Plan"]
[null,"Escoja Segmento",null,"Escoja un Plan",null,"Escoja un Plan"]
[null,"Prepago",null,{"$f":"IF(#REF!=3,D11,IF(#REF!=4,F11,\"---\"))","v":{"$error":"#REF!"}},null,{"$f":"IF('FORMATO RT-PR-01'!$F$9=3,Hoja1!D11,\"---\")","v":"---"}]
[null,"Pospago",null,{"$f":"IF(#REF!=3,D12,IF(#REF!=4,F12,\"---\"))","v":{"$error":"#REF!"}},null,{"$f":"IF('FORMATO RT-PR-01'!$F$9=3,Hoja1!D12,\"---\")","v":"---"}]
[null,"Ambos (Prep & Posp)",null,{"$f":"IF(#REF!=3,D13,IF(#REF!=4,F13,\"---\"))","v":{"$error":"#REF!"}},null,{"$f":"IF('FORMATO RT-PR-01'!$F$9=3,Hoja1!D13,\"---\")","v":"---"}]
[]
[]
[null,null,null,"Plan",null,"Plan 2"]
[null,null,null,"Escoja un Plan",null,"Escoja un Plan"]
[null,null,null,"Abierto",null,"Prep. y Posp. Abierto"]
[null,null,null,"Controlado",null,"Prep. y Posp. Controlado"]
[null,null,null,"Abierto y/o controlado",null,"Prep. Y Posp. (Todos)"]

{"sheet":"FORMATO RT-PR-01","index":1,"n_rows":56,"n_cols":32,"rows_kept":56,"cut":false,"hidden":false,"merged":[[11,7,11,9],[13,7,13,9],[15,7,15,9],[51,4,51,31],[53,4,53,31],[31,19,32,19],[31,20,32,20],[31,21,32,21],[30,26,30,28],[30,29,30,31],[31,8,32,8],[30,17,30,25],[30,4,32,4],[30,5,30,16],[31,5,32,5],[31,9,32,9],[1,1,1,31],[13,4,13,6],[15,4,15,6],[28,4,28,31],[31,27,32,27],[31,28,32,28],[31,29,32,29],[31,30,32,30],[31,31,32,31],[31,22,32,22],[31,23,32,23],[31,24,32,24],[31,25,32,25],[31,26,32,26],[31,17,32,17],[31,18,32,18],[51,2,51,3],[53,2,53,3],[55,2,55,5],[25,4,25,6],[26,4,26,6],[48,2,48,3],[49,2,49,3],[48,4,48,8],[49,4,49,8],[43,2,43,3],[44,2,44,3],[45,2,45,3],[46,2,46,3],[25,2,25,3],[26,2,26,3],[28,2,28,3],[42,2,42,3],[33,2,33,3],[34,2,34,3],[35,2,35,3],[36,2,36,3],[37,2,37,3],[38,2,38,3],[39,2,39,3],[40,2,40,3],[41,2,41,3],[30,2,32,3],[31,6,32,6],[16,4,16,6],[11,4,11,5],[3,4,3,6],[5,4,5,6],[6,4,6,6],[12,5,12,6],[21,6,21,9],[18,9,18,15],[18,5,18,6],[23,6,23,9],[19,6,19,9],[20,6,20,9],[22,6,22,9],[24,6,24,9],[31,16,32,16],[31,11,31,12],[31,10,32,10],[31,7,32,7],[31,13,32,13],[31,14,32,14],[31,15,32,15]]}
[]
[null,"FORMATO RT-PR-01: PROMOCIONES MÓVILES"]
[]
[null,null,"Número de Oficio"]
[null,null,"Fecha de Oficio:"]
[null,null,"Nombre del Prestador:"]
[null,null,"Nombre de la promoción:"]
[null,null,"Fecha de notificación de la promoción:"]
[null,null,null,"Segmento:",null,1,{"$f":"INDEX(Hoja1!B3:B6,$F$9,1)","v":"Escoja Segmento"}]
[null,null,null,null,null,2,{"$f":"IF(G9=\"Pospago\",INDEX(Hoja1!F3:F6,'FORMATO RT-PR-01'!$F$10,1),\"---\")","v":"---"}]
[null,null,"Promoción: "]
[null,null,"Si es modificado señalar: ",null,"       Nombre original de la Promoción:"]
[null,null,"Tarifa promocional : "]
[null,null,"Si es modificado señalar: ",null,"       Nombre original de la Tarifa promocional:"]
[null,null,"Paquete promocional :"]
[null,null,"Si es modificado señalar:",null,"       Nombre original del Paquete promocional:"]
[null,null,"Número Oficio de notificación inicial/anterior:"]
[null,null,"Fecha de notificación inicial/anterior:"]
[]
[null,null,"Servicios incluidos en la Promoción/Tarifa promocional:"]
[]
[]
[]
[]
[]
[null,null,"Fecha de entrada en vigencia de la Promoción,Tarifa promocional o Paquete promocional:"]
[null,null,"Fecha de finalización de la Promoción,Tarifa promocional o Paquete promocional:"]
[]
[null,null,"Condiciones generales de la Promoción,Tarifa promocional o Paquete promocional:"]
[]
[null,null,"Descripción de la Promoción/Tarifa promocional \n(Servicios que incluye, etc.)",null,"Código de Identificación de la Promoción/Tarifa promocional *","VOZ",null,null,null,null,null,null,null,null,null,null,null,"SMS",null,null,null,null,null,null,null,null,"DATOS",null,null,"Otros servicios adicionales"]
[null,null,null,null,null,"Tarifa por minuto\nIN-POOL\n(US$ por min.)","Minutos IN-POOL incluidos\n(min.)","Minutos On Net incluidos \n(min.)","Minutos gratis   a cualquier operadora  (min.)","Tarifa por minuto on net móvil  dentro de la promoción\n(US$ por min.)","Tarifa por minuto on net móvil adicional a la promoción\n(US$ por min.)","Minutos Off Net incluidos \n(min.)",null,"Tarifa por minuto off net móvil dentro de la promoción\n(US$ por min.)","Tarifa por minuto off net fijo dentro de la promoción\n(US$ por min.)","Tarifa por minuto off net móvil adicional a la promoción\n(US$ por min.)","Tarifa por minuto off net fijo adicional a la promoción\n(US$ por min.)","Tarifa por SMS\nIN-POOL\n(US$ por SMS)","SMS\nIN-POOL incluidos\n(#SMS)","Mensajes on net Incluidos\n(# SMS)","Tarifa por SMS on net dentro de la promoción\n(US$ por SMS)","Tarifa por SMS on net adicional a la promoción\n(US$ por SMS)","Mensajes off net Incluidos\n(# SMS)","Mensajes gratis a cualquier operadora\n(# SMS)","Tarifa por SMS off net dentro de la promoción\n(US$ por SMS)","Tarifa por SMS off net adicional a la promoción\n(US$ por SMS)","MB Incluidos en la promoción\n(MB)","Tarifa por MB dentro de la promoción Plan\n(US$ por MB)","Tarifa por MB adicional a la promoción\n(US$ por MB)","Detalle","Unidad de medida","Tarifa US$"]
[null,null,null,null,null,null,null,null,null,null,null,"Móvil","Fijo"]
[]
[]
[]
[]
[]
[null,null,null,null,null,null,null,null,null,null,null,null,null,null,null,null,null,null,null,null,null,null,null,12]
[]
[]
[]
[]
[]
[]
[]
[]
[]
[null,null,"Destinos que  incluyen cargos de Interconexión:"]
[null,null,"Tarifas incluyen impuestos aplicables de Ley:"]
[]
[null,null,"Restricciones aplicables a la Promoción,Tarifa promocional o Paquete promocional:"]
[]
[null,null,"Otras Observaciones:"]
[]
[null,null,"* Código que es usado en las plataformas de tasación y facturación de las operadoras del SMA."]