{"text_format":"1","workbook":"xlsx","n_sheets":2,"sheets":["Hoja1","FORMATO-RT-PR-02"],"not_rendered":{"charts":0,"images":1,"macros":1,"external_links":0,"defined_names":1,"comments":0,"pivot_tables":0},"unopened":[],"bounds":{"document_bytes":16777216,"sheet_cells":100000,"rows_first":2000,"rows_last":500,"rows_between":2000,"halvings":0,"cell_chars":16384,"cell_head_chars":4096},"cells_cut":0,"cells_raw":0,"read":"whole","date_system":"1900"}

{"sheet":"Hoja1","index":0,"n_rows":13,"n_cols":6,"rows_kept":13,"cut":false,"hidden":true,"merged":[[0,1,0,5]]}
[null,"No modificar estas Tablas"]
[null,"Segmento:",null,"Plan",null,"Plan"]
[null,"Escoja Segmento",null,"Escoja un Plan",null,"Escoja un Plan"]
[null,"Prepago",null,{"$f":"IF(#REF!=3,D11,IF(#REF!=4,F11,\"---\"))","v":{"$error":"#REF!"}},null,{"$f":"IF('FORMATO-RT-PR-02'!$F$9=3,Hoja1!D11,\"---\")","v":"---"}]
[null,"Pospago",null,{"$f":"IF(#REF!=3,D12,IF(#REF!=4,F12,\"---\"))","v":{"$error":"#REF!"}},null,{"$f":"IF('FORMATO-RT-PR-02'!$F$9=3,Hoja1!D12,\"---\")","v":"---"}]
[null,"Ambos (Prep & Posp)",null,{"$f":"IF(#REF!=3,D13,IF(#REF!=4,F13,\"---\"))","v":{"$error":"#REF!"}},null,{"$f":"IF('FORMATO-RT-PR-02'!$F$9=3,Hoja1!D13,\"---\")","v":"---"}]
[]
[]
[null,null,null,"Plan",null,"Plan 2"]
[null,null,null,"Escoja un Plan",null,"Escoja un Plan"]
[null,null,null,"Abierto",null,"Prep. y Posp. Abierto"]
[null,null,null,"Controlado",null,"Prep. y Posp. Controlado"]
[null,null,null,"Abierto y/o controlado",null,"Prep. Y Posp. (Todos)"]

{"sheet":"FORMATO-RT-PR-02","index":1,"n_rows":58,"n_cols":33,"rows_kept":58,"cut":false,"hidden":false,"merged":[[49,2,49,3],[54,2,54,3],[56,2,56,3],[51,4,51,7],[52,4,52,7],[54,4,54,32],[56,4,56,32],[51,2,51,3],[52,2,52,3],[17,5,17,6],[12,13,12,18],[13,13,13,18],[48,2,48,3],[39,2,39,3],[40,2,40,3],[41,2,41,3],[42,2,42,3],[43,2,43,3],[44,2,44,3],[45,2,45,3],[46,2,46,3],[47,2,47,3],[29,2,29,4],[30,2,30,4],[29,5,29,7],[30,5,30,7],[34,30,35,32],[35,29,36,29],[15,4,15,6],[1,1,1,32],[11,5,11,8],[11,9,11,11],[13,9,13,11],[34,2,36,3],[58,5,58,12],[34,5,36,5],[34,6,34,18],[34,19,34,26],[35,24,35,26],[55,4,55,18],[35,6,36,6],[35,7,36,7],[35,8,35,9],[35,10,35,11],[35,12,35,13],[35,14,35,15],[57,2,57,6],[37,2,37,3],[38,2,38,3],[13,5,13,8],[32,5,32,32],[34,27,34,29],[35,27,36,27],[35,19,36,19],[35,20,36,20],[35,21,36,21],[31,5,31,18],[15,13,15,18],[17,13,17,18],[16,4,16,5],[35,22,35,23],[35,28,36,28],[35,16,35,18],[34,4,36,4],[32,2,32,4],[3,4,3,6],[4,4,4,5],[5,4,5,6],[6,4,6,6],[7,4,7,5]]}
[]
[null,"FORMATO RT-PR-02: PROMOCIONES DE TELEFONÍA FIJA"]
[]
[null,null,"Número de Oficio"]
[null,null,"Fecha de Oficio:"]
[null,null,"Nombre del Prestador:"]
[null,null,"Nombre de la Promoción:"]
[null,null,"Fecha de notificación de la Promoción:"]
[null,null,null,"Segmento:",null,1,{"$f":"INDEX(Hoja1!B3:B6,$F$9,1)","v":"Escoja Segmento"}]
[null,null,null,null,null,2,{"$f":"IF(G9=\"Pospago\",INDEX(Hoja1!F3:F6,'FORMATO-RT-PR-02'!$F$10,1),\"---\")","v":"---"}]
[null,null,"Promoción :"]
[null,null,"Si es modificado señalar: ",null,null,"Nombre original del Promoción:"]
[null,null,"Tarifa Promocional:  "]
[null,null,"Si es modificado señalar: ",null,null,"Nombre original de la Tarifa Promocional:"]
[]
[null,null,"Número Oficio de notificación inicial/anterior:"]
[null,null,"Fecha de notificación inicial/anterior:"]
[]
[null,null,"Servicios incluidos en el Promoción/Tarifa promocional:"]
[]
[]
[]
[]
[]
[]
[]
[]
[]
[]
[null,null,"Fecha de entrada en vigencia de la Promoción/Tarifa promocional:"]
[null,null,"Fecha de finalización de la Promoción/Tarifa promocional:"]
[]
[null,null,"Condiciones generales de la Promoción/Tarifa promocional:"]
[]
[null,null,"Descripción de la Promoción/Tarifa promocional\n(Servicios que incluye, etc.)",null,"Código de Identificación del Plan/Tarifa *","Tarifa  Total \n(US$)",null,null,null,null,null,null,null,null,null,null,null,null,null,"Terminales de Uso Público",null,null,null,null,null,null,null,"DATOS",null,null,"Otros servicios adicionales"]
[null,null,null,null,null,null,"Minutos incluidos ON NET \n(min.)","Minutos incluidos OFF NET \n(min.)","Tarifa por minuto de llamada Local\n(US$ por min.)",null,"Tarifa por minuto de llamada Nacional\n(US$ por min.)",null,"Tarifa por minuto de llamada Regional\n(US$ por min.)",null,"Tarifa por minuto de llamada LDI",null,"Tarifa por minuto de llamada a Móviles (US$ por min.)",null,null,"Tarifa por minuto de llamada Local\n(US$ por min.)","Tarifa por minuto de llamada Nacional\n(US$ por min.)","Tarifa por minuto de llamada Regional\n(US$ por min.)","Tarifa por minuto de llamada LDI",null,"Tarifa por minuto de llamada a Móviles (US$ por min.)",null,null,"Kbps Incluidos en la Promoción (Kbps)","Tarifa por Kbps dentro de la Promoción\n(US$ por Kbps)","Tarifa por Kbps adicional a la Promoción\n(US$ por Kbps)"]
[null,null,null,null,null,null,null,null,"ON-NET","OFF-NET","ON-NET","OFF-NET","ON-NET","OFF-NET","Destino","US$ por min.","CONECEL S.A.","OTECEL S.A.","CNT EP.",null,null,null,"Destino","US$ por min.","CONECEL S.A.","OTECEL S.A.","CNT EP.",null,null,null,"Detalle","Unidad de medida","Tarifa US$"]
[]
[]
[]
[]
[]
[]
[]
[]
[]
[]
[]
[]
[]
[]
[null,null,"Destinos que  incluyen cargos de Interconexión:"]
[null,null,"Tarifas incluyen impuestos aplicables de Ley:"]
[]
[null,null,"Restricciones aplicables a la Promoción/Tarifa promocional:"]
[]
[null,null,"Otras Observaciones:"]
[null,null,"* Código que es usado en las plataformas de tasación y facturación de las operadoras."]